Target
Sodium-dependent serotonin transporter
Ligand
BDBM50136680
Substrate
Ki
0.8±n/a nM
Comments
PDSP_763
Citation
 Koch, SHemrick-Luecke, SKThompson, LKEvans, DCThrelkeld, PGNelson, DLPerry, KWBymaster, FP Comparison of effects of dual transporter inhibitors on monoamine transporters and extracellular levels in rats. Neuropharmacology 45:935-44 (2003)  
Target
Name:
Sodium-dependent serotonin transporter
Synonyms:
5-HT Transporter 5HTT SC6A4_HUMAN SLC6A4 Serotonin transporter (5HTT) Sodium-dependent serotonin transporter (SERT) | Solute carrier family 6 member 4
Type:
Multi-pass membrane protein
Mol. Mass.:
70322.51
Organism:
Homo sapiens (Human)
Description:
P31645
Residue:
630
  
Inhibitor
Name:
BDBM50136680
Synonyms:
CHEMBL424660 N-methyl-3-(naphthalen-1-yloxy)-3-(2-thienyl)propan-1-amine | duloxetine
Type:
Small organic molecule
Emp. Form.:
C18H19NOS
Mol. Mass.:
297.415
SMILES:
CNCCC(Oc1cccc2ccccc12)c1cccs1
: