Target
5-hydroxytryptamine receptor 6
Ligand
BDBM86428
Substrate
Ki
11.22±n/a nM
Comments
PDSP_3220
Citation
 Hirst, WDAbrahamsen, BBlaney, FECalver, ARAloj, LPrice, GWMedhurst, AD Differences in the central nervous system distribution and pharmacology of the mouse 5-hydroxytryptamine-6 receptor compared with rat and human receptors investigated by radioligand binding, site-directed mutagenesis, and molecular modeling. Mol Pharmacol 64:1295-308 (2003)  
Target
Name:
5-hydroxytryptamine receptor 6
Synonyms:
5-HT6 5HT6R_MOUSE | Htr6
Type:
Enzyme Catalytic Domain
Mol. Mass.:
47012.98
Organism:
MOUSE
Description:
5-HT6 HTR6 MOUSE::Q9R1C8
Residue:
440
  
Inhibitor
Name:
BDBM86428
Synonyms:
SB-258585
Type:
Small organic molecule
Emp. Form.:
C18H22IN3O3S
Mol. Mass.:
487.355
SMILES:
COc1ccc(NS(=O)(=O)c2ccc(I)cc2)cc1N1CCN(C)CC1
: