Target
Delta-type opioid receptor
Ligand
BDBM86445
Substrate
Ki
7.71±n/a nM
Comments
PDSP_4498
Citation
 Spetea, MFriedmann, TRiba, PSchütz, JWunder, GLanger, TSchmidhammer, HFürst, S In vitro opioid activity profiles of 6-amino acid substituted derivatives of 14-O-methyloxymorphone. Eur J Pharmacol 483:301-8 (2004)  
Target
Name:
Delta-type opioid receptor
Synonyms:
Cytochrome P450 3A4 Delta opioid receptor Delta-type opioid receptor (DOR) OPRD_RAT Opioid receptor Opioid receptors; mu & delta Ror-a | Voltage-gated potassium channel
Type:
G Protein-Coupled Receptor (GPCR)
Mol. Mass.:
40465.04
Organism:
Rattus norvegicus (rat)
Description:
Competition binding assays were using CHO-K1 cell membranes expressing the opioid receptor.
Residue:
372
  
Inhibitor
Name:
BDBM86445
Synonyms:
(2S)-2-[4,5alpha-epoxy-3-hydroxy-14beta-methoxy-17-methylmorphinan-6beta-yl)amino]propanoic acid bis(tetrafluoroborate)
Type:
Small organic molecule
Emp. Form.:
C21H28N2O5
Mol. Mass.:
388.4574
SMILES:
COC12CC[C@@H](N[C@H](C)C(O)=O)[C@@H]3Oc4c5c(CC1N(C)CC[C@@]235)ccc4O
: