Target
Mu-type opioid receptor
Ligand
BDBM86444
Substrate
Ki
0.77±n/a nM
Comments
PDSP_4497
Citation
 Spetea, MFriedmann, TRiba, PSchütz, JWunder, GLanger, TSchmidhammer, HFürst, S In vitro opioid activity profiles of 6-amino acid substituted derivatives of 14-O-methyloxymorphone. Eur J Pharmacol 483:301-8 (2004)  
Target
Name:
Mu-type opioid receptor
Synonyms:
MOR-1 Mu-type opioid receptor (MOR) OPRM_RAT Opioid receptor B Ror-b
Type:
G Protein-Coupled Receptor (GPCR)
Mol. Mass.:
44503.11
Organism:
Rattus norvegicus (rat)
Description:
Competition binding assays were carried out using membrane preparations from transfected HN9.10 cells that constitutively expressed the mu opioid receptor.
Residue:
398
  
Inhibitor
Name:
BDBM86444
Synonyms:
(2S)-2-[4,5alpha-epoxy-3-hydroxy-14beta-methoxy-17-methylmorphinan-6alpha-yl)amino]propanoic acid bis(tetrafluoroborate)
Type:
Small organic molecule
Emp. Form.:
C21H28N2O5
Mol. Mass.:
388.4574
SMILES:
COC12CC[C@H](N[C@H](C)C(O)=O)[C@@H]3Oc4c5c(CC1N(C)CC[C@@]235)ccc4O
: