Target
Beta-1 adrenergic receptor
Ligand
BDBM86449
Substrate
Ki
1310±n/a nM
Comments
PDSP_4086
Citation
 Hoffmann, CLeitz, MROberdorf-Maass, SLohse, MJKlotz, KN Comparative pharmacology of human beta-adrenergic receptor subtypes--characterization of stably transfected receptors in CHO cells. Naunyn Schmiedebergs Arch Pharmacol 369:151-9 (2004)  
Target
Name:
Beta-1 adrenergic receptor
Synonyms:
ADRB1 ADRB1_HUMAN Beta-1 adrenoceptor | adrenergic Beta1
Type:
G Protein-Coupled Receptor (GPCR)
Mol. Mass.:
51338.40
Organism:
Homo sapiens (Human)
Description:
P08588
Residue:
477
  
Inhibitor
Name:
BDBM86449
Synonyms:
Broxaterol NSC_71149
Type:
Small organic molecule
Emp. Form.:
C9H15BrN2O2
Mol. Mass.:
263.132
SMILES:
CC(C)(C)NCC(O)c1cc(Br)no1
: