Target
Beta-2 adrenergic receptor
Ligand
BDBM25746
Substrate
Ki
4040±n/a nM
Comments
PDSP_488
Citation
 Hoffmann, CLeitz, MROberdorf-Maass, SLohse, MJKlotz, KN Comparative pharmacology of human beta-adrenergic receptor subtypes--characterization of stably transfected receptors in CHO cells. Naunyn Schmiedebergs Arch Pharmacol 369:151-9 (2004)  
Target
Name:
Beta-2 adrenergic receptor
Synonyms:
ADRB2 ADRB2_HUMAN Beta-2 adrenoceptor | Beta-2 adrenoreceptor
Type:
Mol. Mass.:
46461.69
Organism:
Homo sapiens (Human)
Description:
P07550
Residue:
413
  
Inhibitor
Name:
BDBM25746
Synonyms:
2-hydroxy-5-{2-[(2-hydroxy-3-{4-[1-methyl-4-(trifluoromethyl)-1H-imidazol-2-yl]phenoxy}propyl)amino]ethoxy}benzamide; methanesulfonic acid CGP-20712A | cid_2685
Type:
Small organic molecule
Emp. Form.:
C23H25F3N4O5
Mol. Mass.:
494.4636
SMILES:
Cn1cc(nc1-c1ccc(OCC(O)CNCCOc2ccc(O)c(c2)C(N)=O)cc1)C(F)(F)F
: