Target
D(2) dopamine receptor
Ligand
BDBM50020680
Substrate
Ki
1148.15±n/a nM
Comments
PDSP_1613
Citation
 Millan, MJCussac, DGobert, ALejeune, FRivet, JMMannoury La Cour, CNewman-Tancredi, APeglion, JL S32504, a novel naphtoxazine agonist at dopamine D3/D2 receptors: I. Cellular, electrophysiological, and neurochemical profile in comparison with ropinirole. J Pharmacol Exp Ther 309:903-20 (2004)  
Target
Name:
D(2) dopamine receptor
Synonyms:
DOPAMINE D2 DOPAMINE D2 Short Dopamine D2 receptor Drd2
Type:
G Protein-Coupled Receptor (GPCR)
Mol. Mass.:
50931.60
Organism:
Rattus norvegicus (rat)
Description:
P61169
Residue:
444
  
Inhibitor
Name:
BDBM50020680
Synonyms:
4-[2-(dipropylamino)ethyl]-1,3-dihydro-2H-indol-2-one ROPINIROLE
Type:
Small organic molecule
Emp. Form.:
C16H24N2O
Mol. Mass.:
260.3746
SMILES:
CCCN(CCC)CCc1cccc2NC(=O)Cc12
: