Target
Glutamate receptor ionotropic, kainate 1
Ligand
BDBM50137133
Substrate
Ki
>10000±n/a nM
Comments
PDSP_3545
Citation
 Christensen, JKVarming, TAhring, PKJørgensen, TDNielsen, EA In vitro characterization of 5-carboxyl-2,4-di-benzamidobenzoic acid (NS3763), a noncompetitive antagonist of GLUK5 receptors. J Pharmacol Exp Ther 309:1003-10 (2004)  
Target
Name:
Glutamate receptor ionotropic, kainate 1
Synonyms:
GLUR5 GRIK1_HUMAN Glutamate kainate Glutamate receptor ionotropic kainate 1 Glutamate-Kainate Grik1 protein | hmglur5 flipr
Type:
Enzyme Catalytic Domain
Mol. Mass.:
103984.96
Organism:
Homo sapiens (Human)
Description:
P39086
Residue:
918
  
Inhibitor
Name:
BDBM50137133
Synonyms:
4,6-Bis-benzoylamino-isophthalic acid NS3763
Type:
Small organic molecule
Emp. Form.:
C22H16N2O6
Mol. Mass.:
404.3722
SMILES:
OC(=O)c1cc(C(O)=O)c(NC(=O)c2ccccc2)cc1NC(=O)c1ccccc1
: