Target
P2X purinoceptor 2
Ligand
BDBM50023910
Substrate
Ki
1670±n/a nM
Comments
PDSP_4066
Citation
 Jarvis, MFBianchi, BUchic, JTCartmell, JLee, CHWilliams, MFaltynek, C [3H]A-317491, a novel high-affinity non-nucleotide antagonist that specifically labels human P2X2/3 and P2X3 receptors. J Pharmacol Exp Ther 310:407-16 (2004)  
Target
Name:
P2X purinoceptor 2
Synonyms:
ATP receptor P2RX2_HUMAN Purinergic receptor | PurinergicP2X2/3
Type:
Enzyme Catalytic Domain
Mol. Mass.:
51765.18
Organism:
Homo sapiens (Human)
Description:
PurinergicP2X2/3 0 HUMAN::Q9UBL9
Residue:
471
  
Inhibitor
Name:
BDBM50023910
Synonyms:
({[({[5-(2,4-dioxo-1,2,3,4-tetrahydropyrimidin-1-yl)-3,4-dihydroxyoxolan-2-yl]methoxy}(hydroxy)phosphoryl)oxy](hydroxy)phosphoryl}oxy)phosphonic acid 5-azidouridine-5'-triphosphate derivative Uridine triphosphate (UTP)
Type:
Small organic molecule
Emp. Form.:
C9H15N2O15P3
Mol. Mass.:
484.1411
SMILES:
OC1C(COP(O)(=O)OP(O)(=O)OP(O)(O)=O)OC(C1O)n1ccc(=O)[nH]c1=O
: