Target
5-hydroxytryptamine receptor 2C
Ligand
BDBM50017452
Substrate
Ki
97.72±n/a nM
Comments
PDSP_1240
Citation
 Knight, ARMisra, AQuirk, KBenwell, KRevell, DKennett, GBickerdike, M Pharmacological characterisation of the agonist radioligand binding site of 5-HT(2A), 5-HT(2B) and 5-HT(2C) receptors. Naunyn Schmiedebergs Arch Pharmacol 370:114-23 (2004)  
Target
Name:
5-hydroxytryptamine receptor 2C
Synonyms:
5-HT-2C 5-HT2C-INI 5-HTR2C 5-hydroxytryptamine receptor 2C (5-HT-2C) 5HT-1C HTR1C Serotonin (5-HT3) receptor Serotonin Receptor 2C
Type:
G Protein-Coupled Receptor (GPCR)
Mol. Mass.:
51836.79
Organism:
Homo sapiens (Human)
Description:
P28335
Residue:
458
  
Inhibitor
Name:
BDBM50017452
Synonyms:
2-chloro-6-piperazin-1-ylpyrazine 6'-Chloro-3,4,5,6-tetrahydro-2H-[1,2']bipyrazinyl(MK-212) L-630,571 MK-212
Type:
Small organic molecule
Emp. Form.:
C8H11ClN4
Mol. Mass.:
198.653
SMILES:
Clc1cncc(n1)N1CCNCC1
: