Target
Epidermal growth factor receptor
Ligand
BDBM3595
Substrate
poly(E:Y)
Meas. Tech.
Kinase Inhibition Assay
pH
7.4±n/a
Temperature
298.15±n/a K
IC50
0.09±n/a nM
Citation
 Thompson, AMMurray, DKElliott, WLFry, DWNelson, JAShowalter, HDRoberts, BJVincent, PWDenny, WA Tyrosine kinase inhibitors. 13. Structure-activity relationships for soluble 7-substituted 4-[(3-bromophenyl)amino]pyrido[4,3-d]pyrimidines designed as inhibitors of the tyrosine kinase activity of the epidermal growth factor receptor. J Med Chem 40:3915-25 (1997)  
Target
Name:
Epidermal growth factor receptor
Synonyms:
EGF Receptor Substrate EGFR_HUMAN ERBB1 Epidermal Growth Factor Receptor erbB-1 Epidermal growth factor receptor (EGFR) HER1 Proto-oncogene c-ErbB-1 Tyrosine-Protein Kinase ErbB-1
Type:
Receptor Kinase Domain
Mol. Mass.:
134279.59
Organism:
Homo sapiens (Human)
Description:
P00533
Residue:
1210
  
Inhibitor
Name:
BDBM3595
Synonyms:
4-N-(3-bromophenyl)-7-N,7-N-dimethylpyrido[4,3-d]pyrimidine-4,7-diamine CHEMBL53428 | Pyrido[4,3-d]pyrimidine 5g
Type:
Small organic molecule
Emp. Form.:
C15H14BrN5
Mol. Mass.:
344.209
SMILES:
CN(C)c1cc2ncnc(Nc3cccc(Br)c3)c2cn1
:
Substrate
Name:
poly(E:Y)
Synonyms:
Type:
Random Polymer
Mol. Mass.:
358.43
Organism:
Description:
Polyglutamic acid/tyrosine (Sigma Chemical Co., St. Louis, MO). 10 uM ATP containing 0.5 uCi of [gamma-32P]ATP as co-substrate.
Residue:
3
NA