Target
Beta-arrestin-1
Ligand
BDBM86694
Substrate
Ki
>10000±n/a nM
Comments
PDSP_4918
Citation
 Miyata, NSeki, TTanaka, YOmura, TTaniguchi, KDoi, MBandou, KKametani, SSato, MOkuyama, SCambj-Sapunar, LHarder, DRRoman, RJ Beneficial effects of a new 20-hydroxyeicosatetraenoic acid synthesis inhibitor, TS-011 [N-(3-chloro-4-morpholin-4-yl) phenyl-N'-hydroxyimido formamide], on hemorrhagic and ischemic stroke. J Pharmacol Exp Ther 314:77-85 (2005)  
Target
Name:
Beta-arrestin-1
Synonyms:
ARRB1 Beta-arrestin-1 OPIATE Delta | PAF Platelet activating factor
Type:
Enzyme Catalytic Domain
Mol. Mass.:
46360.54
Organism:
RABBIT
Description:
Cholinergic, muscarinic 0 RABBIT::Q95223
Residue:
410
  
Inhibitor
Name:
BDBM86694
Synonyms:
N'-(3-Chloro-4-morpholinophenyl)-N-hydroxyformamidine | TS-011
Type:
Small organic molecule
Emp. Form.:
C11H14ClN3O2
Mol. Mass.:
255.701
SMILES:
ONC=Nc1ccc(N2CCOCC2)c(Cl)c1
: