Target
Bile salt export pump
Ligand
BDBM86705
Substrate
Ki
>10000±n/a nM
Comments
PDSP_5740
Citation
 Hirano, MMaeda, KHayashi, HKusuhara, HSugiyama, Y Bile salt export pump (BSEP/ABCB11) can transport a nonbile acid substrate, pravastatin. J Pharmacol Exp Ther 314:876-82 (2005)  
Target
Name:
Bile salt export pump
Synonyms:
ABCBB_RAT Abcb11 Bile salt export pump Sister of P-glycoprotein | Spgp
Type:
PROTEIN
Mol. Mass.:
146267.86
Organism:
Rattus norvegicus
Description:
ChEMBL_1481883
Residue:
1321
  
Inhibitor
Name:
BDBM86705
Synonyms:
CAS_141750-63-2 | Pitavastatin lactone
Type:
Small organic molecule
Emp. Form.:
C25H22FNO3
Mol. Mass.:
403.4455
SMILES:
O[C@@H]1C[C@H](OC(=O)C1)\C=C\c1c(nc2ccccc2c1-c1ccc(F)cc1)C1CC1
: