Target
5-hydroxytryptamine receptor 1A
Ligand
BDBM86710
Substrate
Ki
1.05±n/a nM
Comments
PDSP_4571
Citation
 Corradetti, RMlinar, BFalsini, CPugliese, AMCilia, ADestefani, CTesta, R Differential effects of the 5-hydroxytryptamine (5-HT)1A receptor inverse agonists Rec 27/0224 and Rec 27/0074 on electrophysiological responses to 5-HT1A receptor activation in rat dorsal raphe nucleus and hippocampus in vitro. J Pharmacol Exp Ther 315:109-17 (2005)  
Target
Name:
5-hydroxytryptamine receptor 1A
Synonyms:
5-HT-1A 5-hydroxytryptamine receptor 1A (5-HT-1A) ADRB2RL1 Dopamine D2 receptor and serotonin 1a receptor HTR1A | Serotonin receptor 1A
Type:
Mol. Mass.:
46122.49
Organism:
Homo sapiens (Human)
Description:
Residue:
422
  
Inhibitor
Name:
BDBM86710
Synonyms:
Rec 27/0224
Type:
Small organic molecule
Emp. Form.:
C27H33BrF3N3O3
Mol. Mass.:
584.468
SMILES:
COc1ccc(Br)c(c1)N1CCN(CCN(C(=O)C2CCCCC2)c2ccccc2OC(F)(F)F)CC1
: