Target
Alpha-1A adrenergic receptor
Ligand
BDBM86709
Substrate
Ki
5.13±n/a nM
Comments
PDSP_4572
Citation
 Corradetti, RMlinar, BFalsini, CPugliese, AMCilia, ADestefani, CTesta, R Differential effects of the 5-hydroxytryptamine (5-HT)1A receptor inverse agonists Rec 27/0224 and Rec 27/0074 on electrophysiological responses to 5-HT1A receptor activation in rat dorsal raphe nucleus and hippocampus in vitro. J Pharmacol Exp Ther 315:109-17 (2005)  
Target
Name:
Alpha-1A adrenergic receptor
Synonyms:
ADA1A_HUMAN ADRA1C Alpha 1A-adrenoceptor Alpha adrenergic receptor 1a Alpha-adrenergic receptor 1c adrenergic Alpha1 | adrenergic Alpha1C
Type:
Cell-surface receptors
Mol. Mass.:
51511.67
Organism:
Homo sapiens (Human)
Description:
P35348
Residue:
466
  
Inhibitor
Name:
BDBM86709
Synonyms:
Rec 27/0074
Type:
Small organic molecule
Emp. Form.:
C27H37N3O3
Mol. Mass.:
451.601
SMILES:
COc1ccccc1N(CCN1CCN(CC1)c1ccccc1OC)C(=O)C1CCCCC1
: