Target
Alpha-1B adrenergic receptor
Ligand
BDBM21397
Substrate
Ki
3.09±n/a nM
Comments
PDSP_1739
Citation
 Corradetti, RMlinar, BFalsini, CPugliese, AMCilia, ADestefani, CTesta, R Differential effects of the 5-hydroxytryptamine (5-HT)1A receptor inverse agonists Rec 27/0224 and Rec 27/0074 on electrophysiological responses to 5-HT1A receptor activation in rat dorsal raphe nucleus and hippocampus in vitro. J Pharmacol Exp Ther 315:109-17 (2005)  
Target
Name:
Alpha-1B adrenergic receptor
Synonyms:
ADA1B_HUMAN Adrenergic alpha1B Adrenergic receptor alpha Alpha 1B-adrenoreceptor | Alpha-1B adrenergic receptor
Type:
Enzyme
Mol. Mass.:
56862.13
Organism:
Homo sapiens (Human)
Description:
P35368
Residue:
520
  
Inhibitor
Name:
BDBM21397
Synonyms:
8-[4-(4-fluorophenyl)-4-keto-butyl]-1-phenyl-1,3,8-triazaspiro[4.5]decan-4-one 8-[4-(4-fluorophenyl)-4-oxobutyl]-1-phenyl-1,3,8-triazaspiro[4.5]decan-4-one MLS000028615 SPIPERONE US9359372, Spiperone cid_5265
Type:
radiolabeled ligand
Emp. Form.:
C23H26FN3O2
Mol. Mass.:
395.4698
SMILES:
Fc1ccc(cc1)C(=O)CCCN1CCC2(CC1)N(CNC2=O)c1ccccc1
: