Target
5-hydroxytryptamine receptor 2A
Ligand
BDBM50004327
Substrate
Ki
2.893±n/a nM
Comments
PDSP_1177
Citation
 Pehek, EANocjar, CRoth, BLByrd, TAMabrouk, OS Evidence for the preferential involvement of 5-HT2A serotonin receptors in stress- and drug-induced dopamine release in the rat medial prefrontal cortex. Neuropsychopharmacology 31:265-77 (2006)  
Target
Name:
5-hydroxytryptamine receptor 2A
Synonyms:
5-HT-2A 5-HT2A 5-hydroxytryptamine receptor 2A (5HT2A) Htr2 Serotonin Receptor 2A
Type:
G Protein-Coupled Receptor (GPCR)
Mol. Mass.:
52852.05
Organism:
Rattus norvegicus (rat)
Description:
Rat cortex membranes 5-HT2A receptors.
Residue:
471
  
Inhibitor
Name:
BDBM50004327
Synonyms:
(1-Phenethyl-piperidin-4-yl)-phenyl-methanol Glemanserin MDL-11939
Type:
Small organic molecule
Emp. Form.:
C20H25NO
Mol. Mass.:
295.4186
SMILES:
OC(C1CCN(CCc2ccccc2)CC1)c1ccccc1
: