Target
5-hydroxytryptamine receptor 2C
Ligand
BDBM81780
Substrate
Ki
8.243±n/a nM
Comments
PDSP_1752
Citation
 Pehek, EANocjar, CRoth, BLByrd, TAMabrouk, OS Evidence for the preferential involvement of 5-HT2A serotonin receptors in stress- and drug-induced dopamine release in the rat medial prefrontal cortex. Neuropsychopharmacology 31:265-77 (2006)  
Target
Name:
5-hydroxytryptamine receptor 2C
Synonyms:
5-HT2C 5-hydroxytryptamine receptor 2C (5HT2c) 5ht1c Htr2c Serotonin receptor 2a and 2c (5HT2A and 5HT2C)
Type:
Enzyme
Mol. Mass.:
51935.10
Organism:
Rattus norvegicus (Rat)
Description:
P08909
Residue:
460
  
Inhibitor
Name:
BDBM81780
Synonyms:
CAS_6438382 SR 46349B
Type:
Small organic molecule
Emp. Form.:
C19H21FN2O2
Mol. Mass.:
328.3806
SMILES:
CN(C)CCON=C(C=Cc1ccc(O)cc1)c1ccccc1F
: