Target
Muscarinic acetylcholine receptor M3
Ligand
BDBM81780
Substrate
Ki
2387±n/a nM
Comments
PDSP_1752
Citation
 Pehek, EANocjar, CRoth, BLByrd, TAMabrouk, OS Evidence for the preferential involvement of 5-HT2A serotonin receptors in stress- and drug-induced dopamine release in the rat medial prefrontal cortex. Neuropsychopharmacology 31:265-77 (2006)  
Target
Name:
Muscarinic acetylcholine receptor M3
Synonyms:
ACM3_HUMAN Cholinergic, muscarinic M3 Muscarinic receptor M3 | RecName: Full=Muscarinic acetylcholine receptor M3
Type:
Enzyme
Mol. Mass.:
66151.03
Organism:
Homo sapiens (Human)
Description:
P20309
Residue:
590
  
Inhibitor
Name:
BDBM81780
Synonyms:
CAS_6438382 SR 46349B
Type:
Small organic molecule
Emp. Form.:
C19H21FN2O2
Mol. Mass.:
328.3806
SMILES:
CN(C)CCON=C(C=Cc1ccc(O)cc1)c1ccccc1F
: