Target
Histamine H4 receptor
Ligand
BDBM50232153
Substrate
Ki
>10000±n/a nM
Comments
PDSP_1172
Citation
 Pehek, EANocjar, CRoth, BLByrd, TAMabrouk, OS Evidence for the preferential involvement of 5-HT2A serotonin receptors in stress- and drug-induced dopamine release in the rat medial prefrontal cortex. Neuropsychopharmacology 31:265-77 (2006)  
Target
Name:
Histamine H4 receptor
Synonyms:
AXOR35 GPCR105 HH4R HRH4 Histamine H4 receptor Histamine receptor (H3 and H4) SP9144
Type:
G Protein-Coupled Receptor (GPCR)
Mol. Mass.:
44517.02
Organism:
Homo sapiens (Human)
Description:
Binding assays were using CHO cells stably expressing hH4R receptors.
Residue:
390
  
Inhibitor
Name:
BDBM50232153
Synonyms:
(1-(4-fluorophenethyl)piperidin-4-yl)(2,3-dimethoxyphenyl)methanol CHEMBL257283 MDL-100907
Type:
Small organic molecule
Emp. Form.:
C22H28FNO3
Mol. Mass.:
373.461
SMILES:
COc1cccc(C(O)C2CCN(CCc3ccc(F)cc3)CC2)c1OC
: