Target
D(2) dopamine receptor
Ligand
BDBM50002012
Substrate
Ki
0.3±n/a nM
Comments
PDSP_4325
Citation
 Burstein, ESMa, JWong, SGao, YPham, EKnapp, AENash, NROlsson, RDavis, REHacksell, UWeiner, DMBrann, MR Intrinsic efficacy of antipsychotics at human D2, D3, and D4 dopamine receptors: identification of the clozapine metabolite N-desmethylclozapine as a D2/D3 partial agonist. J Pharmacol Exp Ther 315:1278-87 (2005)  
Target
Name:
D(2) dopamine receptor
Synonyms:
D(2) dopamine receptor DOPAMINE D2 Long DRD2 Dopamine D2 receptor Dopamine D2 receptor (D2R) Dopamine2-like | d2
Type:
Cell-surface receptors
Mol. Mass.:
50647.10
Organism:
Homo sapiens (Human)
Description:
P14416
Residue:
443
  
Inhibitor
Name:
BDBM50002012
Synonyms:
(trans) 2-{4-[3-(4-Fluoro-phenyl)-6-trifluoromethyl-indan-1-yl]-piperazin-1-yl}-ethanol CHEMBL1204138 tefludazine
Type:
Small organic molecule
Emp. Form.:
C22H24F4N2O
Mol. Mass.:
408.4324
SMILES:
OCCN1CCN(CC1)C1CC(c2ccc(cc12)C(F)(F)F)c1ccc(F)cc1
: