Target
D(3) dopamine receptor
Ligand
BDBM50002012
Substrate
Ki
0.6±n/a nM
Comments
PDSP_4325
Citation
 Burstein, ESMa, JWong, SGao, YPham, EKnapp, AENash, NROlsson, RDavis, REHacksell, UWeiner, DMBrann, MR Intrinsic efficacy of antipsychotics at human D2, D3, and D4 dopamine receptors: identification of the clozapine metabolite N-desmethylclozapine as a D2/D3 partial agonist. J Pharmacol Exp Ther 315:1278-87 (2005)  
Target
Name:
D(3) dopamine receptor
Synonyms:
DOPAMINE D3 DRD3_HUMAN Dopamine D3 receptor (D3) Dopamine receptor Dopamine receptor D3
Type:
Mol. Mass.:
44243.43
Organism:
Homo sapiens (Human)
Description:
Residue:
400
  
Inhibitor
Name:
BDBM50002012
Synonyms:
(trans) 2-{4-[3-(4-Fluoro-phenyl)-6-trifluoromethyl-indan-1-yl]-piperazin-1-yl}-ethanol CHEMBL1204138 tefludazine
Type:
Small organic molecule
Emp. Form.:
C22H24F4N2O
Mol. Mass.:
408.4324
SMILES:
OCCN1CCN(CC1)C1CC(c2ccc(cc12)C(F)(F)F)c1ccc(F)cc1
: