Target
Platelet-derived growth factor receptor alpha
Ligand
BDBM50237710
Substrate
Ki
2±n/a nM
Comments
PDSP_6404
Citation
 Melnick, JSJanes, JKim, SChang, JYSipes, DGGunderson, DJarnes, LMatzen, JTGarcia, MEHood, TLBeigi, RXia, GHarig, RAAsatryan, HYan, SFZhou, YGu, XJSaadat, AZhou, VKing, FJShaw, CMSu, AIDowns, RGray, NSSchultz, PGWarmuth, MCaldwell, JS An efficient rapid system for profiling the cellular activities of molecular libraries. Proc Natl Acad Sci U S A 103:3153-8 (2006)  
Target
Name:
Platelet-derived growth factor receptor alpha
Synonyms:
Alpha-type platelet-derived growth factor receptor PDGFRA PGFRA_HUMAN Platelet-derived growth factor receptor alpha (PDGFRA) RHEPDGFRA
Type:
Protein
Mol. Mass.:
122633.38
Organism:
Homo sapiens (Human)
Description:
P16234
Residue:
1089
  
Inhibitor
Name:
BDBM50237710
Synonyms:
4-methyl-N-[3-(4-methyl-1H-imidazol-1-yl)-5-(trifluoromethyl)phenyl]-3-[(4-pyridin-3-ylpyrimidin-2-yl)amino]benzamide AMN107 NILOTINIB | US11649218, Example Nilotinib
Type:
Small organic molecule
Emp. Form.:
C28H22F3N7O
Mol. Mass.:
529.5158
SMILES:
Cc1cn(cn1)-c1cc(NC(=O)c2ccc(C)c(Nc3nccc(n3)-c3cccnc3)c2)cc(c1)C(F)(F)F
: