Target
Histamine H1 receptor
Ligand
BDBM86747
Substrate
Ki
2200±n/a nM
Comments
PDSP_6447
Citation
 Xie, SXKraus, AGhorai, PYe, QZElz, SBuschauer, ASeifert, R N1-(3-cyclohexylbutanoyl)-N2-[3-(1H-imidazol-4-yl)propyl]guanidine (UR-AK57), a potent partial agonist for the human histamine H1- and H2-receptors. J Pharmacol Exp Ther 317:1262-8 (2006)  
Target
Name:
Histamine H1 receptor
Synonyms:
HISTAMINE H1 HRH1_CAVPO
Type:
G Protein-Coupled Receptor (GPCR)
Mol. Mass.:
55641.53
Organism:
Cavia porcellus (domestic guinea pig)
Description:
Guinea pig cerebellum was used in binding assay.
Residue:
488
  
Inhibitor
Name:
BDBM86747
Synonyms:
UR-AK67
Type:
Small organic molecule
Emp. Form.:
C17H23N5O
Mol. Mass.:
313.3974
SMILES:
NC(NC(=O)CCCc1ccccc1)=NCCCc1cnc[nH]1
: