Target
Histamine H2 receptor
Ligand
BDBM86744
Substrate
Ki
62±n/a nM
Comments
PDSP_6452
Citation
 Xie, SXKraus, AGhorai, PYe, QZElz, SBuschauer, ASeifert, R N1-(3-cyclohexylbutanoyl)-N2-[3-(1H-imidazol-4-yl)propyl]guanidine (UR-AK57), a potent partial agonist for the human histamine H1- and H2-receptors. J Pharmacol Exp Ther 317:1262-8 (2006)  
Target
Name:
Histamine H2 receptor
Synonyms:
Gastric receptor I HISTAMINE H2 HRH2_HUMAN Histamine H2-Gs alpha S
Type:
G Protein-Coupled Receptor (GPCR)
Mol. Mass.:
40115.31
Organism:
Homo sapiens (Human)
Description:
Residue:
359
  
Inhibitor
Name:
BDBM86744
Synonyms:
UR-AK62
Type:
Small organic molecule
Emp. Form.:
C15H25N5O
Mol. Mass.:
291.3919
SMILES:
NC(NC(=O)CC1CCCCC1)=NCCCc1cnc[nH]1
: