Target
Histamine H2 receptor
Ligand
BDBM86736
Substrate
Ki
29±n/a nM
Comments
PDSP_6449
Citation
 Xie, SXKraus, AGhorai, PYe, QZElz, SBuschauer, ASeifert, R N1-(3-cyclohexylbutanoyl)-N2-[3-(1H-imidazol-4-yl)propyl]guanidine (UR-AK57), a potent partial agonist for the human histamine H1- and H2-receptors. J Pharmacol Exp Ther 317:1262-8 (2006)  
Target
Name:
Histamine H2 receptor
Synonyms:
Gastric receptor I HISTAMINE H2 HRH2_CAVPO | Histamine H2-Gs alpha S
Type:
G Protein-Coupled Receptor (GPCR)
Mol. Mass.:
40567.22
Organism:
Cavia porcellus (domestic guinea pig)
Description:
For the H2 receptor-binding assays, guinea pig striatum was used.
Residue:
359
  
Inhibitor
Name:
BDBM86736
Synonyms:
UR-AK68
Type:
Small organic molecule
Emp. Form.:
C16H21N5O
Mol. Mass.:
299.3708
SMILES:
CC(C(=O)NC(N)=NCCCc1cnc[nH]1)c1ccccc1
: