Target
Opioid receptor delta 1
Ligand
BDBM86757
Substrate
Ki
>10000±n/a nM
Comments
PDSP_7627
Citation
 Kumar, JSPrabhakaran, JMajo, VJMilak, MSHsiung, SCTamir, HSimpson, NRVan Heertum, RLMann, JJParsey, RV Synthesis and in vivo evaluation of a novel 5-HT1A receptor agonist radioligand [O-methyl- 11C]2-(4-(4-(2-methoxyphenyl)piperazin-1-yl)butyl)-4-methyl-1,2,4-triazine-3,5(2H,4H)dione in nonhuman primates. Eur J Nucl Med Mol Imaging 34:1050-60 (2007)  
Target
Name:
Opioid receptor delta 1
Synonyms:
Type:
PROTEIN
Mol. Mass.:
40708.41
Organism:
Bos taurus
Description:
ChEMBL_863801
Residue:
372
  
Inhibitor
Name:
BDBM86757
Synonyms:
CAS_0 [11C]MMP
Type:
Small organic molecule
Emp. Form.:
C19H27N5O3
Mol. Mass.:
373.4494
SMILES:
COc1ccccc1N1CCN(CCCCn2ncc(=O)n(C)c2=O)CC1
: