Target
Kappa-type opioid receptor
Ligand
BDBM86929
Substrate
Ki
0.24±n/a nM
Comments
PDSP_8452
Citation
 Ghirmai, SAzar, MRPolgar, WEBerzetei-Gurske, ICashman, JR Synthesis and biological evaluation of alpha- and beta-6-amido derivatives of 17-cyclopropylmethyl-3, 14beta-dihydroxy-4, 5alpha-epoxymorphinan: potential alcohol-cessation agents. J Med Chem 51:1913-24 (2008)  
Target
Name:
Kappa-type opioid receptor
Synonyms:
K-OR-1 Kappa-opioid receptor (KOR) Kappa-type opioid receptor (KOR) OPIATE Kappa OPRK1 kappa opioid receptor (KOR)
Type:
G Protein-Coupled Receptor (GPCR)
Mol. Mass.:
42648.76
Organism:
Homo sapiens (Human)
Description:
P41145
Residue:
380
  
Inhibitor
Name:
BDBM86929
Synonyms:
17-cyclopropylmethyl-3,14-beta-dihydroxy-4,5-alpha-epoxy-6-alpha-[(3'-methoxy)benzamido]morphinan CAS_24822631 NSC_24822631 | NSC_24822799
Type:
Small organic molecule
Emp. Form.:
C28H32N2O5
Mol. Mass.:
476.5641
SMILES:
COc1cccc(c1)C(=O)NC1CCC2(O)C3Cc4ccc(O)c5OC1C2(CCN3CC1CC1)c45
: