Target
Kappa-type opioid receptor
Ligand
BDBM86923
Substrate
Ki
0.45±n/a nM
Comments
PDSP_8446
Citation
 Ghirmai, SAzar, MRPolgar, WEBerzetei-Gurske, ICashman, JR Synthesis and biological evaluation of alpha- and beta-6-amido derivatives of 17-cyclopropylmethyl-3, 14beta-dihydroxy-4, 5alpha-epoxymorphinan: potential alcohol-cessation agents. J Med Chem 51:1913-24 (2008)  
Target
Name:
Kappa-type opioid receptor
Synonyms:
K-OR-1 Kappa-opioid receptor (KOR) Kappa-type opioid receptor (KOR) OPIATE Kappa OPRK1 kappa opioid receptor (KOR)
Type:
G Protein-Coupled Receptor (GPCR)
Mol. Mass.:
42648.76
Organism:
Homo sapiens (Human)
Description:
P41145
Residue:
380
  
Inhibitor
Name:
BDBM86923
Synonyms:
17-cyclopropylmethyl-3,14-beta-dihydroxy-4,5-alpha-epoxy-6-beta-[(3'-methoxy)phenylacetamido]morphinan NSC_24822300
Type:
Small organic molecule
Emp. Form.:
C29H34N2O5
Mol. Mass.:
490.5907
SMILES:
COc1cccc(CC(=O)NC2CCC3(O)C4Cc5ccc(O)c6OC2C3(CCN4CC2CC2)c56)c1
: