Target
Kappa-type opioid receptor
Ligand
BDBM86258
Substrate
Ki
65.5±n/a nM
Comments
PDSP_1250
Citation
 Cunningham, CWMercer, SLHassan, HETraynor, JREddington, NDCoop, A Opioids and efflux transporters. Part 2: P-glycoprotein substrate activity of 3- and 6-substituted morphine analogs. J Med Chem 51:2316-20 (2008)  
Target
Name:
Kappa-type opioid receptor
Synonyms:
K-OR-1 Kappa-opioid receptor (KOR) Kappa-type opioid receptor (KOR) OPIATE Kappa OPRK1 kappa opioid receptor (KOR)
Type:
G Protein-Coupled Receptor (GPCR)
Mol. Mass.:
42648.76
Organism:
Homo sapiens (Human)
Description:
P41145
Residue:
380
  
Inhibitor
Name:
BDBM86258
Synonyms:
CAS_23552-18-3 NSC_5980
Type:
Small organic molecule
Emp. Form.:
C17H19NO3
Mol. Mass.:
285.3377
SMILES:
CN1CCC23C4Oc5c2c(CC1C3C=CC4O)ccc5O
: