Target
Polyphenol oxidase 2
Ligand
BDBM50130191
Substrate
Meas. Tech.
Enzyme Assay
pH
6.8±0
Temperature
298.15±0 K
IC50
2.957e+5±n/a nM
Citation
 Liu, SHChu, IMPan, IH Effects of hydroxybenzyl alcohols on melanogenesis in melanocyte-keratinocyte co-culture and monolayer culture of melanocytes. J Enzyme Inhib Med Chem 23:526-34 (2008)  
Target
Name:
Polyphenol oxidase 2
Synonyms:
Monophenol monooxygenase PPO2 Tyrosinase
Type:
Protein
Mol. Mass.:
63923.66
Organism:
Agaricus bisporus (Common mushroom)
Description:
O42713
Residue:
556
  
Inhibitor
Name:
BDBM50130191
Synonyms:
2-Hydroxymethyl-6-(4-hydroxy-phenoxy)-tetrahydro-pyran-3,4,5-triol | Arbutin
Type:
Small organic molecule
Emp. Form.:
C12H16O7
Mol. Mass.:
272.2512
SMILES:
OCC1OC(Oc2ccc(O)cc2)C(O)C(O)C1O
: