Target
Tegument protein VP16
Ligand
BDBM87284
Substrate
Meas. Tech.
Counterscreen for inhibitors of the Steroid Receptor Coactivator 3 (SRC3; NCOA3)
IC50
7230±n/a nM
Citation
 PubChem, PC Counterscreen for inhibitors of the Steroid Receptor Coactivator 3 (SRC3; NCOA3): Luminescence-based cell-based high throughput dose response assay to identify inhibitors of the Herpes Virus Virion Protein 16 (VP16) PubChem Bioassay (2012)[AID] 
Target
Name:
Tegument protein VP16
Synonyms:
Alpha trans-inducing protein (VP16) transactivating tegument protein VP16
Type:
PROTEIN
Mol. Mass.:
54325.13
Organism:
Human herpesvirus 1 (strain 17) (HHV-1) (Human herpes simplex virus1)
Description:
EBI_100271
Residue:
490
  
Inhibitor
Name:
BDBM87284
Synonyms:
3,4,5-trimethoxy-N-[(E)-[phenyl(2-pyridinyl)methylidene]amino]benzamide 3,4,5-trimethoxy-N-[(E)-[phenyl(pyridin-2-yl)methylidene]amino]benzamide SMR000260029 | cid_5674353
Type:
Small organic molecule
Emp. Form.:
C22H21N3O4
Mol. Mass.:
391.4198
SMILES:
COc1cc(cc(OC)c1OC)C(=O)N\N=C(/c1ccccc1)c1ccccn1
: