Target
Botulinum neurotoxin type A
Ligand
BDBM3645
Substrate
Meas. Tech.
High-throughput multiplex microsphere dose response for inhibitors of toxin protease, specifically Botulinum neurotoxin light chain A protease, compounds from Cherry Pick 01
EC50
>20000±n/a nM
Citation
 PubChem, PC High-throughput multiplex microsphere dose response for inhibitors of toxin protease, specifically Botulinum neurotoxin light chain A protease, compounds from Cherry Pick 01 PubChem Bioassay (2012)[AID] 
Target
Name:
Botulinum neurotoxin type A
Synonyms:
BXA1_CLOBH bna | botA
Type:
PROTEIN
Mol. Mass.:
149421.96
Organism:
Clostridium botulinum (strain Hall / ATCC 3502 / NCTC 13319 / Type A)
Description:
ChEMBL_987932
Residue:
1296
  
Inhibitor
Name:
BDBM3645
Synonyms:
cid_3095057
Type:
Emp. Form.:
C11H7N5O7
Mol. Mass.:
321.2026
SMILES:
[O-][N+](=O)c1cc(cc(c1)[N+]([O-])=O)C(=O)Nc1c[nH]c(=O)[nH]c1=O
: