Target
Botulinum neurotoxin type A
Ligand
BDBM53136
Substrate
Meas. Tech.
High-throughput multiplex microsphere dose response for inhibitors of toxin protease, specifically Botulinum neurotoxin light chain A protease, compounds from Cherry Pick 01
EC50
>20000±n/a nM
Citation
 PubChem, PC High-throughput multiplex microsphere dose response for inhibitors of toxin protease, specifically Botulinum neurotoxin light chain A protease, compounds from Cherry Pick 01 PubChem Bioassay (2012)[AID] 
Target
Name:
Botulinum neurotoxin type A
Synonyms:
BXA1_CLOBH bna | botA
Type:
PROTEIN
Mol. Mass.:
149421.96
Organism:
Clostridium botulinum (strain Hall / ATCC 3502 / NCTC 13319 / Type A)
Description:
ChEMBL_987932
Residue:
1296
  
Inhibitor
Name:
BDBM53136
Synonyms:
(9-amino-7-ethoxy-acridin-3-yl)-p-anisyl-amine 7-ethoxy-N3-[(4-methoxyphenyl)methyl]acridine-3,9-diamine SMR000539104 | cid_2885134
Type:
Small organic molecule
Emp. Form.:
C23H23N3O2
Mol. Mass.:
373.4476
SMILES:
CCOc1ccc2nc3cc(NCc4ccc(OC)cc4)ccc3c(N)c2c1
: