Target
Botulinum neurotoxin type F
Ligand
BDBM72686
Substrate
Meas. Tech.
High-throughput multiplex microsphere dose response for inhibitors of toxin protease, specifically Botulinum neurotoxin light chain F protease, compounds from Cherry Pick 01
EC50
>20000±n/a nM
Citation
 PubChem, PC High-throughput multiplex microsphere dose response for inhibitors of toxin protease, specifically Botulinum neurotoxin light chain F protease, compounds from Cherry Pick 01 PubChem Bioassay (2012)[AID] 
Target
Name:
Botulinum neurotoxin type F
Synonyms:
BXF_CLOBO botulinum neurotoxin type F, BoNT/F
Type:
Enzyme Catalytic Domain
Mol. Mass.:
146691.56
Organism:
Clostridium botulinum Bf
Description:
P30996
Residue:
1274
  
Inhibitor
Name:
BDBM72686
Synonyms:
3-(1H-benzimidazol-2-ylamino)-1-isoindolone MLS000757049 cid_328013
Type:
Small organic molecule
Emp. Form.:
C15H10N4O
Mol. Mass.:
262.2661
SMILES:
O=C1N=C(Nc2nc3ccccc3[nH]2)c2ccccc12
: