Target
Botulinum neurotoxin type F
Ligand
BDBM51248
Substrate
Meas. Tech.
High-throughput multiplex microsphere dose response for inhibitors of toxin protease, specifically Botulinum neurotoxin light chain F protease, compounds from Cherry Pick 01
EC50
>20000±n/a nM
Citation
 PubChem, PC High-throughput multiplex microsphere dose response for inhibitors of toxin protease, specifically Botulinum neurotoxin light chain F protease, compounds from Cherry Pick 01 PubChem Bioassay (2012)[AID] 
Target
Name:
Botulinum neurotoxin type F
Synonyms:
BXF_CLOBO botulinum neurotoxin type F, BoNT/F
Type:
Enzyme Catalytic Domain
Mol. Mass.:
146691.56
Organism:
Clostridium botulinum Bf
Description:
P30996
Residue:
1274
  
Inhibitor
Name:
BDBM51248
Synonyms:
6-(3-Nitro-phenyl)-2,3-diphenyl-imidazo[1,2-b][1,2,4]triazine 6-(3-nitrophenyl)-2,3-diphenylimidazo[1,2-b][1,2,4]triazine SMR000436067 | cid_1422604
Type:
Small organic molecule
Emp. Form.:
C23H15N5O2
Mol. Mass.:
393.3975
SMILES:
[O-][N+](=O)c1cccc(c1)-c1cn2nc(-c3ccccc3)c(nc2n1)-c1ccccc1
: