Target
Tyrosine-protein kinase ABL1
Ligand
BDBM87468
Substrate
Meas. Tech.
TRFRET-based biochemical high throughput dose response assay for inhibitors of the interaction of the Ras and Rab interactor 1 protein (Rin1) and the c-abl oncogene 1
IC50
52022±n/a nM
Citation
 PubChem, PC TRFRET-based biochemical high throughput dose response assay for inhibitors of the interaction of the Ras and Rab interactor 1 protein (Rin1) and the c-abl oncogene 1, non-receptor tyrosine kinase (Abl) PubChem Bioassay (2012)[AID] 
Target
Name:
Tyrosine-protein kinase ABL1
Synonyms:
ABL ABL1_HUMAN JTK7 Proto-oncogene tyrosine-protein kinase ABL1 Tyrosine-protein kinase ABL V-abl Abelson murine leukemia viral oncogene homolog 1 p150 | tyrosine-protein kinase ABL1 isoform a
Type:
Enzyme
Mol. Mass.:
122897.30
Organism:
Homo sapiens (Human)
Description:
P00519
Residue:
1130
  
Inhibitor
Name:
BDBM87468
Synonyms:
MLS000879146 N-[2-(dimethylamino)ethyl]-N-(6-ethoxy-1,3-benzothiazol-2-yl)-3-methoxy-2-naphthamide;hydrochloride N-[2-(dimethylamino)ethyl]-N-(6-ethoxy-1,3-benzothiazol-2-yl)-3-methoxynaphthalene-2-carboxamide;hydrochloride cid_24761837
Type:
Small organic molecule
Emp. Form.:
C25H27N3O3S
Mol. Mass.:
449.565
SMILES:
CCOc1ccc2nc(sc2c1)N(CCN(C)C)C(=O)c1cc2ccccc2cc1OC
: