Target
Melanocortin receptor 4
Ligand
BDBM88491
Substrate
Meas. Tech.
Luminescence-based cell-based high throughput dose response assay for biased ligands (agonists) of the melanocortin 4 receptor (MC4R)
EC50
>89187±n/a nM
Citation
 PubChem, PC Luminescence-based cell-based high throughput dose response assay for biased ligands (agonists) of the melanocortin 4 receptor (MC4R) PubChem Bioassay (2012)[AID] 
Target
Name:
Melanocortin receptor 4
Synonyms:
MC4-R MC4R_HUMAN Melanocortin receptor 4 (MC-4) Melanocortin receptor 4 (MC4R)
Type:
Enzyme
Mol. Mass.:
36949.50
Organism:
Homo sapiens (Human)
Description:
P32245
Residue:
332
  
Inhibitor
Name:
BDBM88491
Synonyms:
5-[2-[2-(4-mesylphenyl)-5-methoxy-benzothiophen-3-yl]ethynyl]-1-methyl-imidazole 5-[2-[5-methoxy-2-(4-methylsulfonylphenyl)-1-benzothiophen-3-yl]ethynyl]-1-methylimidazole SMR001397736 | cid_44202221
Type:
Small organic molecule
Emp. Form.:
C22H18N2O3S2
Mol. Mass.:
422.52
SMILES:
COc1ccc2sc(c(C#Cc3cncn3C)c2c1)-c1ccc(cc1)S(C)(=O)=O
: