Target
Botulinum neurotoxin type A
Ligand
BDBM88694
Substrate
Meas. Tech.
High-throughput multiplex microsphere dose response for inhibitors of toxin protease, specifically Botulinum neurotoxin light chain A protease, compounds from Cherry Pick 02
EC50
>20000±n/a nM
Citation
 PubChem, PC High-throughput multiplex microsphere dose response for inhibitors of toxin protease, specifically Botulinum neurotoxin light chain A protease, compounds from Cherry Pick 02 PubChem Bioassay (2012)[AID] 
Target
Name:
Botulinum neurotoxin type A
Synonyms:
BXA1_CLOBH bna | botA
Type:
PROTEIN
Mol. Mass.:
149421.96
Organism:
Clostridium botulinum (strain Hall / ATCC 3502 / NCTC 13319 / Type A)
Description:
ChEMBL_987932
Residue:
1296
  
Inhibitor
Name:
BDBM88694
Synonyms:
MLS000101696 N-[2-(2-methylindol-1-yl)ethyl]propanamide SMR000016276 | cid_4652371
Type:
Small organic molecule
Emp. Form.:
C14H18N2O
Mol. Mass.:
230.3055
SMILES:
CCC(=O)NCCn1c(C)cc2ccccc12
: