Target
Botulinum neurotoxin type A
Ligand
BDBM50999
Substrate
Meas. Tech.
High-throughput multiplex microsphere dose response for inhibitors of toxin protease, specifically Botulinum neurotoxin light chain A protease, compounds from Cherry Pick 02
EC50
>20000±n/a nM
Citation
 PubChem, PC High-throughput multiplex microsphere dose response for inhibitors of toxin protease, specifically Botulinum neurotoxin light chain A protease, compounds from Cherry Pick 02 PubChem Bioassay (2012)[AID] 
Target
Name:
Botulinum neurotoxin type A
Synonyms:
BXA1_CLOBH bna | botA
Type:
PROTEIN
Mol. Mass.:
149421.96
Organism:
Clostridium botulinum (strain Hall / ATCC 3502 / NCTC 13319 / Type A)
Description:
ChEMBL_987932
Residue:
1296
  
Inhibitor
Name:
BDBM50999
Synonyms:
3-(1,3-benzodioxol-5-yl)-2-methylsulfonyl-5-phenyl-3,4-dihydropyrazole 5-Benzo[1,3]dioxol-5-yl-1-methanesulfonyl-3-phenyl-4,5-dihydro-1H-pyrazole SMR000172323 | cid_3153499
Type:
Small organic molecule
Emp. Form.:
C17H16N2O4S
Mol. Mass.:
344.385
SMILES:
CS(=O)(=O)N1N=C(CC1c1ccc2OCOc2c1)c1ccccc1
: