Target
Botulinum neurotoxin type A
Ligand
BDBM76483
Substrate
Meas. Tech.
High-throughput multiplex microsphere dose response for inhibitors of toxin protease, specifically Botulinum neurotoxin light chain A protease, compounds from Cherry Pick 02
EC50
>20000±n/a nM
Citation
 PubChem, PC High-throughput multiplex microsphere dose response for inhibitors of toxin protease, specifically Botulinum neurotoxin light chain A protease, compounds from Cherry Pick 02 PubChem Bioassay (2012)[AID] 
Target
Name:
Botulinum neurotoxin type A
Synonyms:
BXA1_CLOBH bna | botA
Type:
PROTEIN
Mol. Mass.:
149421.96
Organism:
Clostridium botulinum (strain Hall / ATCC 3502 / NCTC 13319 / Type A)
Description:
ChEMBL_987932
Residue:
1296
  
Inhibitor
Name:
BDBM76483
Synonyms:
MLS000335917 [2-(7-ethyl-1H-indol-3-yl)-2-oxidanylidene-ethyl] benzoate benzoic acid [2-(7-ethyl-1H-indol-3-yl)-2-keto-ethyl] ester cid_2125022
Type:
Small organic molecule
Emp. Form.:
C19H17NO3
Mol. Mass.:
307.3432
SMILES:
CCc1cccc2c(c[nH]c12)C(=O)COC(=O)c1ccccc1
: