Target
Botulinum neurotoxin type A
Ligand
BDBM88699
Substrate
Meas. Tech.
High-throughput multiplex microsphere dose response for inhibitors of toxin protease, specifically Botulinum neurotoxin light chain A protease, compounds from Cherry Pick 02
EC50
>20000±n/a nM
Citation
 PubChem, PC High-throughput multiplex microsphere dose response for inhibitors of toxin protease, specifically Botulinum neurotoxin light chain A protease, compounds from Cherry Pick 02 PubChem Bioassay (2012)[AID] 
Target
Name:
Botulinum neurotoxin type A
Synonyms:
BXA1_CLOBH bna | botA
Type:
PROTEIN
Mol. Mass.:
149421.96
Organism:
Clostridium botulinum (strain Hall / ATCC 3502 / NCTC 13319 / Type A)
Description:
ChEMBL_987932
Residue:
1296
  
Inhibitor
Name:
BDBM88699
Synonyms:
4,8-dimethylspiro[3,4-dihydro-1H-quinoline-2,1'-cyclopentane];hydrochloride SMR000427738 | cid_16681803
Type:
Small organic molecule
Emp. Form.:
C15H21N
Mol. Mass.:
215.3339
SMILES:
CC1CC2(CCCC2)Nc2c(C)cccc12
: