Target
Botulinum neurotoxin type A
Ligand
BDBM88701
Substrate
Meas. Tech.
High-throughput multiplex microsphere dose response for inhibitors of toxin protease, specifically Botulinum neurotoxin light chain A protease, compounds from Cherry Pick 02
EC50
>20000±n/a nM
Citation
 PubChem, PC High-throughput multiplex microsphere dose response for inhibitors of toxin protease, specifically Botulinum neurotoxin light chain A protease, compounds from Cherry Pick 02 PubChem Bioassay (2012)[AID] 
Target
Name:
Botulinum neurotoxin type A
Synonyms:
BXA1_CLOBH bna | botA
Type:
PROTEIN
Mol. Mass.:
149421.96
Organism:
Clostridium botulinum (strain Hall / ATCC 3502 / NCTC 13319 / Type A)
Description:
ChEMBL_987932
Residue:
1296
  
Inhibitor
Name:
BDBM88701
Synonyms:
4-methoxy-N-[2-(4-methoxyphenyl)-2-(1-pyrrolidinyl)ethyl]-3-(1-pyrrolidinylsulfonyl)benzamide 4-methoxy-N-[2-(4-methoxyphenyl)-2-pyrrolidin-1-ylethyl]-3-pyrrolidin-1-ylsulfonylbenzamide MLS002155885 cid_16296062
Type:
Small organic molecule
Emp. Form.:
C25H33N3O5S
Mol. Mass.:
487.612
SMILES:
COc1ccc(cc1)C(CNC(=O)c1ccc(OC)c(c1)S(=O)(=O)N1CCCC1)N1CCCC1
: