Target
Botulinum neurotoxin type A
Ligand
BDBM88712
Substrate
Meas. Tech.
High-throughput multiplex microsphere dose response for inhibitors of toxin protease, specifically Botulinum neurotoxin light chain A protease, compounds from Cherry Pick 02
EC50
>20000±n/a nM
Citation
 PubChem, PC High-throughput multiplex microsphere dose response for inhibitors of toxin protease, specifically Botulinum neurotoxin light chain A protease, compounds from Cherry Pick 02 PubChem Bioassay (2012)[AID] 
Target
Name:
Botulinum neurotoxin type A
Synonyms:
BXA1_CLOBH bna | botA
Type:
PROTEIN
Mol. Mass.:
149421.96
Organism:
Clostridium botulinum (strain Hall / ATCC 3502 / NCTC 13319 / Type A)
Description:
ChEMBL_987932
Residue:
1296
  
Inhibitor
Name:
BDBM88712
Synonyms:
6-bromanyl-3-[(3-chlorophenyl)methyl]-5,7-dimethyl-2-(4-methylphenyl)imidazo[1,2-a]pyridine 6-bromo-3-[(3-chlorophenyl)methyl]-5,7-dimethyl-2-(4-methylphenyl)imidazo[1,2-a]pyridine SMR002134600 | cid_53299772
Type:
Small organic molecule
Emp. Form.:
C23H20BrClN2
Mol. Mass.:
439.775
SMILES:
Cc1ccc(cc1)-c1nc2cc(C)c(Br)c(C)n2c1Cc1cccc(Cl)c1
: