Target
Botulinum neurotoxin type A
Ligand
BDBM88713
Substrate
Meas. Tech.
High-throughput multiplex microsphere dose response for inhibitors of toxin protease, specifically Botulinum neurotoxin light chain A protease, compounds from Cherry Pick 02
EC50
>20000±n/a nM
Citation
 PubChem, PC High-throughput multiplex microsphere dose response for inhibitors of toxin protease, specifically Botulinum neurotoxin light chain A protease, compounds from Cherry Pick 02 PubChem Bioassay (2012)[AID] 
Target
Name:
Botulinum neurotoxin type A
Synonyms:
BXA1_CLOBH bna | botA
Type:
PROTEIN
Mol. Mass.:
149421.96
Organism:
Clostridium botulinum (strain Hall / ATCC 3502 / NCTC 13319 / Type A)
Description:
ChEMBL_987932
Residue:
1296
  
Inhibitor
Name:
BDBM88713
Synonyms:
6-bromanyl-2-(3-bromophenyl)-3-[(3-chlorophenyl)methyl]-5,7-dimethyl-imidazo[1,2-a]pyridine 6-bromo-2-(3-bromophenyl)-3-[(3-chlorophenyl)methyl]-5,7-dimethylimidazo[1,2-a]pyridine SMR002134611 | cid_53299783
Type:
Small organic molecule
Emp. Form.:
C22H17Br2ClN2
Mol. Mass.:
504.645
SMILES:
Cc1cc2nc(c(Cc3cccc(Cl)c3)n2c(C)c1Br)-c1cccc(Br)c1
: