Target
Botulinum neurotoxin type A
Ligand
BDBM88714
Substrate
Meas. Tech.
High-throughput multiplex microsphere dose response for inhibitors of toxin protease, specifically Botulinum neurotoxin light chain A protease, compounds from Cherry Pick 02
EC50
>20000±n/a nM
Citation
 PubChem, PC High-throughput multiplex microsphere dose response for inhibitors of toxin protease, specifically Botulinum neurotoxin light chain A protease, compounds from Cherry Pick 02 PubChem Bioassay (2012)[AID] 
Target
Name:
Botulinum neurotoxin type A
Synonyms:
BXA1_CLOBH bna | botA
Type:
PROTEIN
Mol. Mass.:
149421.96
Organism:
Clostridium botulinum (strain Hall / ATCC 3502 / NCTC 13319 / Type A)
Description:
ChEMBL_987932
Residue:
1296
  
Inhibitor
Name:
BDBM88714
Synonyms:
6-bromanyl-3-[(2-methoxyphenyl)methyl]-5,7-dimethyl-2-(4-methylphenyl)imidazo[1,2-a]pyridine 6-bromo-5,7-dimethyl-3-o-anisyl-2-(p-tolyl)imidazo[1,2-a]pyridine SMR002134620 | cid_53299790
Type:
Small organic molecule
Emp. Form.:
C24H23BrN2O
Mol. Mass.:
435.356
SMILES:
COc1ccccc1Cc1c(nc2cc(C)c(Br)c(C)n12)-c1ccc(C)cc1
: