Target
Mitochondrial import inner membrane translocase subunit TIM10
Ligand
BDBM77785
Substrate
Meas. Tech.
SAR analysis of small molecule inhibitors of tim23-1: a luminescent tim10-1 yeast counterscreen.
IC50
1880±n/a nM
Citation
 PubChem, PC SAR analysis of small molecule inhibitors of tim23-1: a luminescent tim10-1 yeast counterscreen. PubChem Bioassay (2012)[AID] 
Target
Name:
Mitochondrial import inner membrane translocase subunit TIM10
Synonyms:
MRS11 TIM10_YEAST TPA: Essential protein of the mitochondrial intermembrane space, forms a complex with Tim9p (TIM10 complex) that delivers hydrophobic proteins to the TIM22 complex for insertion into the inner ...
Type:
Enzyme Catalytic Domain
Mol. Mass.:
10303.50
Organism:
Saccharomyces cerevisiae S288c
Description:
gi_285809906
Residue:
93
  
Inhibitor
Name:
BDBM77785
Synonyms:
2-chloranyl-N-[3-(4-methylphenyl)-1-phenyl-pyrazol-4-yl]ethanamide 2-chloro-N-[3-(4-methylphenyl)-1-phenyl-4-pyrazolyl]acetamide MLS000770839 cid_2104090
Type:
Small organic molecule
Emp. Form.:
C18H16ClN3O
Mol. Mass.:
325.792
SMILES:
Cc1ccc(cc1)-c1nn(cc1NC(=O)CCl)-c1ccccc1
: