Target
Kallikrein-7
Ligand
BDBM113296
Substrate
Meas. Tech.
KLK7 Assay
pH
7.2±n/a
Temperature
310.15±n/a K
Ki
155±n/a nM
Comments
extracted
Citation
 Wagberg, FLeonardsson, G Benzoxazinone derivatives for treatment of skin diseases US Patent  US9695194 Publication Date 7/4/2017 
Target
Name:
Kallikrein-7
Synonyms:
KLK7 Kallikrein 7 PRSS6 Serine protease 6 hK7 kallikrein-7 isoform 1 preproprotein
Type:
PROTEIN
Mol. Mass.:
27535.05
Organism:
Homo sapiens (Human)
Description:
ChEMBL_1469257
Residue:
253
  
Inhibitor
Name:
BDBM113296
Synonyms:
US9695194, 13
Type:
Small organic molecule
Emp. Form.:
C17H13NO5
Mol. Mass.:
311.2888
SMILES:
COc1ccccc1-c1nc2cc3OCCOc3cc2c(=O)o1
: