Target
Cathepsin G
Ligand
BDBM50289001
Substrate
Meas. Tech.
Cathepsin G Assay
pH
7.2±n/a
Temperature
310.15±n/a K
Ki
1900±n/a nM
Comments
extracted
Citation
 Wagberg, FLeonardsson, G Benzoxazinone derivatives for treatment of skin diseases US Patent  US9695194 Publication Date 7/4/2017 
Target
Name:
Cathepsin G
Synonyms:
CATG_HUMAN CTSG
Type:
PROTEIN
Mol. Mass.:
28860.08
Organism:
Homo sapiens (Human)
Description:
ChEMBL_1469016
Residue:
255
  
Inhibitor
Name:
BDBM50289001
Synonyms:
2-(2-Iodo-phenyl)-6,7-dimethoxy-benzo[d][1,3]oxazin-4-one US9695194, 18
Type:
Small organic molecule
Emp. Form.:
C16H12INO4
Mol. Mass.:
409.1753
SMILES:
COc1cc2nc(oc(=O)c2cc1OC)-c1ccccc1I
: