Target
Botulinum neurotoxin type A
Ligand
BDBM61118
Substrate
Meas. Tech.
High-throughput multiplex microsphere dose response for inhibitors of toxin protease, specifically Botulinum neurotoxin light chain A protease, compounds from Powder Set 01
EC50
1400±n/a nM
Citation
 PubChem, PC High-throughput multiplex microsphere dose response for inhibitors of toxin protease, specifically Botulinum neurotoxin light chain A protease, compounds from Powder Set 01 PubChem Bioassay (2012)[AID] 
Target
Name:
Botulinum neurotoxin type A
Synonyms:
BXA1_CLOBH bna | botA
Type:
PROTEIN
Mol. Mass.:
149421.96
Organism:
Clostridium botulinum (strain Hall / ATCC 3502 / NCTC 13319 / Type A)
Description:
ChEMBL_987932
Residue:
1296
  
Inhibitor
Name:
BDBM61118
Synonyms:
1-(2-Methoxy-phenyl)-3-(4-nitro-phenyl)-5-phenyl-4,5-dihydro-1H-pyrazole 2-(2-methoxyphenyl)-5-(4-nitrophenyl)-3-phenyl-3,4-dihydropyrazole SMR000515423 | cid_2865835
Type:
Small organic molecule
Emp. Form.:
C22H19N3O3
Mol. Mass.:
373.4046
SMILES:
COc1ccccc1[N+]1=N[C-](CC1c1ccccc1)c1ccc(cc1)[N+]([O-])=O
: